Information card for entry 7220024
Formula | C30 H18 N6 O12 Zn2 |
Calculated formula | C30 H18 N6 O12 Zn2 |
Title of publication | Pillared-bilayer porous coordination polymers of Zn(ii): enhanced hydrophobicity of pore surface by changing the pillar functionality |
Authors of publication | Bhattacharya, Biswajit; Haldar, Ritesh; Maity, Dilip Kumar; Maji, Tapas Kumar; Ghoshal, Debajyoti |
Journal of publication | CrystEngComm |
Year of publication | 2015 |
Journal volume | 17 |
Journal issue | 18 |
Pages of publication | 3478 |
a | 28.825 ± 0.012 Å |
b | 7.737 ± 0.002 Å |
c | 16.014 ± 0.006 Å |
α | 90° |
β | 108.23 ± 0.03° |
γ | 90° |
Cell volume | 3392 ± 2 Å3 |
Cell temperature | 298 ± 2 K |
Ambient diffraction temperature | 298 ± 2 K |
Number of distinct elements | 5 |
Space group number | 15 |
Hermann-Mauguin space group symbol | C 1 2/c 1 |
Hall space group symbol | -C 2yc |
Residual factor for all reflections | 0.0726 |
Residual factor for significantly intense reflections | 0.0483 |
Weighted residual factors for significantly intense reflections | 0.137 |
Weighted residual factors for all reflections included in the refinement | 0.1544 |
Goodness-of-fit parameter for all reflections included in the refinement | 1.029 |
Diffraction radiation wavelength | 0.71073 Å |
Diffraction radiation type | MoKα |