Information card for entry 7220034
Formula | C25 H27 Co2 N O10 |
Calculated formula | C25 H27 Co2 N O10 |
Title of publication | Four binuclear coordination polymers with a 63net and self-assembly of 2D 63topology into different supramolecular networks using unit‒unit H-bonds |
Authors of publication | Xu, Guohai; Xie, Min; Li, Xiaokang; Shi, Wenjie; Yu, Hui; Hu, Yinhui; Xun, Xiaochen; Xie, Yongrong |
Journal of publication | CrystEngComm |
Year of publication | 2015 |
Journal volume | 17 |
Journal issue | 19 |
Pages of publication | 3677 |
a | 10.1815 ± 0.0011 Å |
b | 11.5501 ± 0.0012 Å |
c | 11.6759 ± 0.0012 Å |
α | 108.454 ± 0.001° |
β | 96.56 ± 0.002° |
γ | 92.829 ± 0.002° |
Cell volume | 1288.6 ± 0.2 Å3 |
Cell temperature | 298 ± 2 K |
Ambient diffraction temperature | 298 ± 2 K |
Number of distinct elements | 5 |
Space group number | 2 |
Hermann-Mauguin space group symbol | P -1 |
Hall space group symbol | -P 1 |
Residual factor for all reflections | 0.0497 |
Residual factor for significantly intense reflections | 0.0406 |
Weighted residual factors for significantly intense reflections | 0.1043 |
Weighted residual factors for all reflections included in the refinement | 0.1105 |
Goodness-of-fit parameter for all reflections included in the refinement | 1.036 |
Diffraction radiation wavelength | 0.71073 Å |
Diffraction radiation type | MoKα |