Information card for entry 7220036
Formula | C39 H47 Co2 N O12 |
Calculated formula | C39 H47 Co2 N O12 |
Title of publication | Four binuclear coordination polymers with a 63net and self-assembly of 2D 63topology into different supramolecular networks using unit‒unit H-bonds |
Authors of publication | Xu, Guohai; Xie, Min; Li, Xiaokang; Shi, Wenjie; Yu, Hui; Hu, Yinhui; Xun, Xiaochen; Xie, Yongrong |
Journal of publication | CrystEngComm |
Year of publication | 2015 |
Journal volume | 17 |
Journal issue | 19 |
Pages of publication | 3677 |
a | 16.635 ± 0.005 Å |
b | 9.405 ± 0.005 Å |
c | 25.855 ± 0.005 Å |
α | 90° |
β | 96.657 ± 0.005° |
γ | 90° |
Cell volume | 4018 ± 3 Å3 |
Cell temperature | 298 ± 2 K |
Ambient diffraction temperature | 298 ± 2 K |
Number of distinct elements | 5 |
Space group number | 14 |
Hermann-Mauguin space group symbol | P 1 21/n 1 |
Hall space group symbol | -P 2yn |
Residual factor for all reflections | 0.0884 |
Residual factor for significantly intense reflections | 0.0481 |
Weighted residual factors for significantly intense reflections | 0.117 |
Weighted residual factors for all reflections included in the refinement | 0.1485 |
Goodness-of-fit parameter for all reflections included in the refinement | 1.037 |
Diffraction radiation wavelength | 0.71069 Å |
Diffraction radiation type | MoKα |