Information card for entry 7220063
Chemical name | spiro |
Formula | C30 H22 N4 O4.5 S0.5 |
Calculated formula | C30 H22 N4 O4.5 S0.5 |
Title of publication | Reaction of isatins with 6-amino uracils and isoxazoles: isatin ring-opening vs. annulations and regioselective synthesis of isoxazole fused quinoline scaffolds in water |
Authors of publication | Poomathi, Nataraj; Mayakrishnan, Sivakalai; Muralidharan, Doraiswamy; Srinivasan, Rajagopal; Perumal, Paramasivan T. |
Journal of publication | Green Chem. |
Year of publication | 2015 |
Journal volume | 17 |
Journal issue | 6 |
Pages of publication | 3362 |
a | 24.9048 ± 0.0006 Å |
b | 9.498 ± 0.0002 Å |
c | 22.2694 ± 0.0006 Å |
α | 90° |
β | 110.723 ± 0.001° |
γ | 90° |
Cell volume | 4926.9 ± 0.2 Å3 |
Cell temperature | 296 ± 2 K |
Ambient diffraction temperature | 296 ± 2 K |
Number of distinct elements | 5 |
Space group number | 14 |
Hermann-Mauguin space group symbol | P 1 21/c 1 |
Hall space group symbol | -P 2ybc |
Residual factor for all reflections | 0.2374 |
Residual factor for significantly intense reflections | 0.0662 |
Weighted residual factors for significantly intense reflections | 0.1511 |
Weighted residual factors for all reflections included in the refinement | 0.2177 |
Goodness-of-fit parameter for all reflections included in the refinement | 0.942 |
Diffraction radiation wavelength | 0.71073 Å |
Diffraction radiation type | MoKα |