Information card for entry 7220082
Formula | C51 H41 B Cu F4 N3 O P2 |
Calculated formula | C51 H41 B Cu F4 N3 O P2 |
SMILES | [Cu]12([n]3n(c4ccccc4C)ccc3c3[n]2cccc3)[P](c2ccccc2)(c2ccccc2)c2c(Oc3c([P]1(c1ccccc1)c1ccccc1)cccc3)cccc2.[B](F)(F)(F)[F-] |
Title of publication | Four highly efficient cuprous complexes and their applications in solution-processed organic light-emitting diodes |
Authors of publication | Zhang, Qing; Chen, Xu-Lin; Chen, Jun; Wu, Xiao-Yuan; Yu, Rong-Min; Lu, Can-Zhong |
Journal of publication | RSC Adv. |
Year of publication | 2015 |
a | 22.372 ± 0.005 Å |
b | 19.795 ± 0.004 Å |
c | 21.048 ± 0.005 Å |
α | 90° |
β | 97.376 ± 0.004° |
γ | 90° |
Cell volume | 9244 ± 4 Å3 |
Cell temperature | 293 ± 2 K |
Ambient diffraction temperature | 293 ± 2 K |
Number of distinct elements | 8 |
Space group number | 15 |
Hermann-Mauguin space group symbol | C 1 2/c 1 |
Hall space group symbol | -C 2yc |
Residual factor for all reflections | 0.0705 |
Residual factor for significantly intense reflections | 0.0651 |
Weighted residual factors for significantly intense reflections | 0.2061 |
Weighted residual factors for all reflections included in the refinement | 0.2128 |
Goodness-of-fit parameter for all reflections included in the refinement | 1.078 |
Diffraction radiation wavelength | 0.71073 Å |
Diffraction radiation type | MoKα |