Information card for entry 7220110
Formula | C84 H68 Cu2 Fe2 I2 O4 Se4 |
Calculated formula | C84 H68 Cu2 Fe2 I2 O4 Se4 |
SMILES | [I]1[Cu]23([I][Cu]412[Se]([c]12[cH]5[cH]6[cH]7[cH]1[Fe]189%102567[c]2([cH]1[cH]8[cH]9[cH]%102)[Se]4CCOc1c2ccccc2cc2ccccc12)CCOc1c2ccccc2cc2ccccc12)[Se](CCOc1c2ccccc2cc2ccccc12)[c]12[cH]4[cH]5[cH]6[cH]1[Fe]17892456[c]2([cH]1[cH]7[cH]8[cH]92)[Se]3CCOc1c2ccccc2cc2ccccc12 |
Title of publication | Anthracene-based ferrocenylselenoethers: syntheses, crystal structures, Cu(I) complexes and sensoring property |
Authors of publication | Liu, Yu-Qing; Ji, Wei; Zhou, Hai-Yan; Li, Yu; Jing, Su; Zhu, Dunru; Zhang, jian |
Journal of publication | RSC Adv. |
Year of publication | 2015 |
a | 8.5325 ± 0.0012 Å |
b | 14.3569 ± 0.0019 Å |
c | 15.512 ± 0.002 Å |
α | 85.587 ± 0.002° |
β | 79.112 ± 0.002° |
γ | 89.858 ± 0.002° |
Cell volume | 1860.3 ± 0.4 Å3 |
Cell temperature | 293 ± 2 K |
Ambient diffraction temperature | 293 ± 2 K |
Number of distinct elements | 7 |
Space group number | 2 |
Hermann-Mauguin space group symbol | P -1 |
Hall space group symbol | -P 1 |
Residual factor for all reflections | 0.0593 |
Residual factor for significantly intense reflections | 0.0399 |
Weighted residual factors for significantly intense reflections | 0.0895 |
Weighted residual factors for all reflections included in the refinement | 0.0958 |
Goodness-of-fit parameter for all reflections included in the refinement | 0.979 |
Diffraction radiation wavelength | 0.71073 Å |
Diffraction radiation type | MoKα |