Information card for entry 7220173
Common name | OXDPPO |
Chemical name | ((1,3,4-oxadiazole-2,5-diyl)bis(4,1-phenylene))bis(diphenylphosphine oxide) |
Formula | C38 H29 N2 O3.5 P2 |
Calculated formula | C38 H29 N2 O3.5 P2 |
Title of publication | Solution-Processed Oxadiazole-Based Electron-Transporting Layer for White Organic Light-Emitting Diodes |
Authors of publication | Liu, Ronghua; Xu, Xinjun; Peng, Jinghong; Yao, Chuang; Wang, Jinshan; Li, Lidong |
Journal of publication | RSC Adv. |
Year of publication | 2015 |
a | 8.6042 ± 0.0019 Å |
b | 12.291 ± 0.003 Å |
c | 16.26 ± 0.004 Å |
α | 110.945 ± 0.004° |
β | 91.262 ± 0.002° |
γ | 94.507 ± 0.003° |
Cell volume | 1598.7 ± 0.7 Å3 |
Cell temperature | 173.15 K |
Ambient diffraction temperature | 173.15 K |
Number of distinct elements | 5 |
Space group number | 2 |
Hermann-Mauguin space group symbol | P -1 |
Hall space group symbol | -P 1 |
Residual factor for all reflections | 0.0487 |
Residual factor for significantly intense reflections | 0.0442 |
Weighted residual factors for significantly intense reflections | 0.1034 |
Weighted residual factors for all reflections included in the refinement | 0.1065 |
Goodness-of-fit parameter for all reflections included in the refinement | 1.085 |
Diffraction radiation wavelength | 0.71073 Å |
Diffraction radiation type | MoKα |