Information card for entry 7220184
Formula | C29 H26 F N O2 |
Calculated formula | C29 H26 F N O2 |
SMILES | Fc1ccc(c2c(n(c3c2cccc3)C(C)C)/C=C/C=C/C(=O)c2ccc(OC)cc2)cc1 |
Title of publication | Synthesis, crystal studies and in vivo anti-hyperlipidemic activities of indole derivatives containing fluvastatin nucleus |
Authors of publication | Kalalbandi, Veerendra Kumar A.; Seetharamappa, J.; Katrahalli, Umesha |
Journal of publication | RSC Adv. |
Year of publication | 2015 |
Journal volume | 5 |
Journal issue | 48 |
Pages of publication | 38748 |
a | 8.6019 ± 0.0002 Å |
b | 11.274 ± 0.0003 Å |
c | 12.5983 ± 0.0003 Å |
α | 92.118 ± 0.001° |
β | 105.254 ± 0.001° |
γ | 101.513 ± 0.001° |
Cell volume | 1149.81 ± 0.05 Å3 |
Cell temperature | 296 ± 2 K |
Ambient diffraction temperature | 296 ± 2 K |
Number of distinct elements | 5 |
Space group number | 2 |
Hermann-Mauguin space group symbol | P -1 |
Hall space group symbol | -P 1 |
Residual factor for all reflections | 0.0513 |
Residual factor for significantly intense reflections | 0.0396 |
Weighted residual factors for significantly intense reflections | 0.1036 |
Weighted residual factors for all reflections included in the refinement | 0.1125 |
Goodness-of-fit parameter for all reflections included in the refinement | 1.027 |
Diffraction radiation wavelength | 0.71073 Å |
Diffraction radiation type | MoKα |