Information card for entry 7220238
Formula | C14 H16 Co N2 O8 |
Calculated formula | C14 H16 Co N2 O8 |
SMILES | C1c2cc(cc[n]2[Co]2([OH]1)([OH2])([n]1c(C[OH]2)cc(cc1)C(=O)[O-])[OH2])C(=O)[O-] |
Title of publication | Isolation of first row transition metal‒carboxylate zwitterions |
Authors of publication | Armaghan, Mahsa; Lu, Wei-Yu; Wu, Di; Wei, Yao; Yuan, Feng-Ling; Weng, Ng Seik; MOHHAMADPOUR AMINI, MOSTAFA; Zhang, Wen-Hua; Young, David James; Hor, Andy; Lang, Jian-Ping |
Journal of publication | RSC Adv. |
Year of publication | 2015 |
a | 7.1867 ± 0.0003 Å |
b | 13.3223 ± 0.0006 Å |
c | 16.8797 ± 0.0007 Å |
α | 90° |
β | 90° |
γ | 90° |
Cell volume | 1616.12 ± 0.12 Å3 |
Cell temperature | 296 ± 2 K |
Ambient diffraction temperature | 296 ± 2 K |
Number of distinct elements | 5 |
Space group number | 61 |
Hermann-Mauguin space group symbol | P b c a |
Hall space group symbol | -P 2ac 2ab |
Residual factor for all reflections | 0.0467 |
Residual factor for significantly intense reflections | 0.0357 |
Weighted residual factors for significantly intense reflections | 0.0974 |
Weighted residual factors for all reflections included in the refinement | 0.1056 |
Goodness-of-fit parameter for all reflections included in the refinement | 1.112 |
Diffraction radiation wavelength | 0.71073 Å |
Diffraction radiation type | MoKα |