Information card for entry 7220243
Formula |
C17 H21 Cu N3 O8 |
Calculated formula |
C17 H21 Cu N3 O8 |
Title of publication |
Isolation of first row transition metal‒carboxylate zwitterions |
Authors of publication |
Armaghan, Mahsa; Lu, Wei-Yu; Wu, Di; Wei, Yao; Yuan, Feng-Ling; Weng, Ng Seik; MOHHAMADPOUR AMINI, MOSTAFA; Zhang, Wen-Hua; Young, David James; Hor, Andy; Lang, Jian-Ping |
Journal of publication |
RSC Adv. |
Year of publication |
2015 |
a |
7.451 ± 0.002 Å |
b |
10.916 ± 0.003 Å |
c |
12.454 ± 0.004 Å |
α |
90° |
β |
106.955 ± 0.006° |
γ |
90° |
Cell volume |
968.9 ± 0.5 Å3 |
Cell temperature |
296 ± 2 K |
Ambient diffraction temperature |
296 ± 2 K |
Number of distinct elements |
5 |
Space group number |
14 |
Hermann-Mauguin space group symbol |
P 1 21/n 1 |
Hall space group symbol |
-P 2yn |
Residual factor for all reflections |
0.1145 |
Residual factor for significantly intense reflections |
0.0719 |
Weighted residual factors for significantly intense reflections |
0.1907 |
Weighted residual factors for all reflections included in the refinement |
0.2294 |
Goodness-of-fit parameter for all reflections included in the refinement |
1.089 |
Diffraction radiation wavelength |
0.71073 Å |
Diffraction radiation type |
MoKα |
Yes |
Yes |
No |