Information card for entry 7220247
Formula | C26 H24 N2 O8 Zn |
Calculated formula | C26 H24 N2 O8 Zn |
SMILES | C1c2cc(cc[n]2[Zn]2([OH]1)([OH2])([n]1c(C[OH]2)cc(cc1)c1ccc(cc1)C(=O)[O-])[OH2])c1ccc(cc1)C(=O)[O-] |
Title of publication | Isolation of first row transition metal‒carboxylate zwitterions |
Authors of publication | Armaghan, Mahsa; Lu, Wei-Yu; Wu, Di; Wei, Yao; Yuan, Feng-Ling; Weng, Ng Seik; MOHHAMADPOUR AMINI, MOSTAFA; Zhang, Wen-Hua; Young, David James; Hor, Andy; Lang, Jian-Ping |
Journal of publication | RSC Adv. |
Year of publication | 2015 |
a | 28.325 ± 0.002 Å |
b | 7.1216 ± 0.0006 Å |
c | 12.6168 ± 0.0013 Å |
α | 90° |
β | 114.533 ± 0.014° |
γ | 90° |
Cell volume | 2315.3 ± 0.4 Å3 |
Cell temperature | 100 ± 2 K |
Ambient diffraction temperature | 100 ± 2 K |
Number of distinct elements | 5 |
Space group number | 15 |
Hermann-Mauguin space group symbol | C 1 2/c 1 |
Hall space group symbol | -C 2yc |
Residual factor for all reflections | 0.0685 |
Residual factor for significantly intense reflections | 0.0572 |
Weighted residual factors for significantly intense reflections | 0.1459 |
Weighted residual factors for all reflections included in the refinement | 0.1594 |
Goodness-of-fit parameter for all reflections included in the refinement | 1.06 |
Diffraction radiation wavelength | 1.54184 Å |
Diffraction radiation type | CuKα |