Information card for entry 7220250
Formula | C26 H24 Co N2 O8 |
Calculated formula | C26 H24 Co N2 O8 |
SMILES | C1c2cc(cc[n]2[Co]2([OH]1)([OH2])([n]1c(C[OH]2)cc(cc1)c1cccc(c1)C(=O)[O-])[OH2])c1cccc(c1)C(=O)[O-] |
Title of publication | Isolation of first row transition metal‒carboxylate zwitterions |
Authors of publication | Armaghan, Mahsa; Lu, Wei-Yu; Wu, Di; Wei, Yao; Yuan, Feng-Ling; Weng, Ng Seik; MOHHAMADPOUR AMINI, MOSTAFA; Zhang, Wen-Hua; Young, David James; Hor, Andy; Lang, Jian-Ping |
Journal of publication | RSC Adv. |
Year of publication | 2015 |
a | 25.051 ± 0.011 Å |
b | 7.425 ± 0.003 Å |
c | 12.951 ± 0.006 Å |
α | 90° |
β | 107.721 ± 0.008° |
γ | 90° |
Cell volume | 2294.6 ± 1.7 Å3 |
Cell temperature | 123 ± 2 K |
Ambient diffraction temperature | 123 ± 2 K |
Number of distinct elements | 5 |
Space group number | 15 |
Hermann-Mauguin space group symbol | C 1 2/c 1 |
Hall space group symbol | -C 2yc |
Residual factor for all reflections | 0.1329 |
Residual factor for significantly intense reflections | 0.0575 |
Weighted residual factors for significantly intense reflections | 0.0934 |
Weighted residual factors for all reflections included in the refinement | 0.1167 |
Goodness-of-fit parameter for all reflections included in the refinement | 0.988 |
Diffraction radiation wavelength | 0.71073 Å |
Diffraction radiation type | MoKα |