Information card for entry 7220259
Formula | C16 H20 Eu2 N2 O21 |
Calculated formula | C16 H20 Eu2 N2 O21 |
Title of publication | Synthesis, structures and photoluminescence of a series of 3D lanthanide‒organic coordination polymers constructed from versatile 2,2′-bipyridine-3,3′-dicarboxylic acid 1,1′-dioxide and oxalic acid |
Authors of publication | Zhang, Lijuan; Zhu, Hongwei; Guo, Yan; Zhou, Yunshan; Yue, Qing; Shi, Zonghai |
Journal of publication | CrystEngComm |
Year of publication | 2015 |
Journal volume | 17 |
Journal issue | 22 |
Pages of publication | 4150 |
a | 7.7297 ± 0.0004 Å |
b | 10.2725 ± 0.0005 Å |
c | 16.0234 ± 0.0009 Å |
α | 86.817 ± 0.004° |
β | 85.974 ± 0.005° |
γ | 77.107 ± 0.004° |
Cell volume | 1236.13 ± 0.11 Å3 |
Cell temperature | 100 ± 2 K |
Ambient diffraction temperature | 100 ± 2 K |
Number of distinct elements | 5 |
Space group number | 2 |
Hermann-Mauguin space group symbol | P -1 |
Hall space group symbol | -P 1 |
Residual factor for all reflections | 0.0684 |
Residual factor for significantly intense reflections | 0.0454 |
Weighted residual factors for significantly intense reflections | 0.0655 |
Weighted residual factors for all reflections included in the refinement | 0.0734 |
Goodness-of-fit parameter for all reflections included in the refinement | 1.008 |
Diffraction radiation wavelength | 0.71073 Å |
Diffraction radiation type | MoKα |