Information card for entry 7220266
Formula | C42 H26 N4 O13 Tb2 |
Calculated formula | C42 H26 N4 O13 Tb2 |
Title of publication | Lanthanide coordination frameworks constructed from 1,3-benzenedicarboxylate, oxalate and 1,10-phenanthroline: crystal structure, multicolor luminescence and high-efficiency white light emission |
Authors of publication | Huo, Rui; Li, Xia; Ma, Dou |
Journal of publication | CrystEngComm |
Year of publication | 2015 |
Journal volume | 17 |
Journal issue | 20 |
Pages of publication | 3838 |
a | 10.8919 ± 0.0015 Å |
b | 12.852 ± 0.0017 Å |
c | 14.933 ± 0.002 Å |
α | 70.463 ± 0.003° |
β | 82.65 ± 0.002° |
γ | 85.85 ± 0.003° |
Cell volume | 1952.8 ± 0.5 Å3 |
Cell temperature | 296 ± 2 K |
Ambient diffraction temperature | 296 ± 2 K |
Number of distinct elements | 5 |
Space group number | 2 |
Hermann-Mauguin space group symbol | P -1 |
Hall space group symbol | -P 1 |
Residual factor for all reflections | 0.1191 |
Residual factor for significantly intense reflections | 0.057 |
Weighted residual factors for significantly intense reflections | 0.077 |
Weighted residual factors for all reflections included in the refinement | 0.0953 |
Goodness-of-fit parameter for all reflections included in the refinement | 0.822 |
Diffraction radiation wavelength | 0.71073 Å |
Diffraction radiation type | MoKα |