Information card for entry 7220303
Formula | Bi2 Mo2.66 O12 W0.34 |
Calculated formula | Bi2 Mo2.656 O12 W0.344 |
Title of publication | Top-seeded solution growth and characterization of a Bi2Mo2.66W0.34O12single crystal |
Authors of publication | Tian, Xiangxin; Wu, Qian; Zhao, Peng; Wang, Zheng; Feng, Xiaoxiao; Li, Conggang; Sun, Youxuan; Wang, Shanpeng; Gao, Zeliang; Tao, Xutang |
Journal of publication | CrystEngComm |
Year of publication | 2015 |
Journal volume | 17 |
Journal issue | 24 |
Pages of publication | 4525 |
a | 7.7212 ± 0.0008 Å |
b | 11.4938 ± 0.0012 Å |
c | 11.997 ± 0.0012 Å |
α | 90° |
β | 115.507 ± 0.001° |
γ | 90° |
Cell volume | 960.91 ± 0.17 Å3 |
Cell temperature | 293 ± 2 K |
Ambient diffraction temperature | 293 ± 2 K |
Number of distinct elements | 4 |
Space group number | 14 |
Hermann-Mauguin space group symbol | P 1 21/c 1 |
Hall space group symbol | -P 2ybc |
Residual factor for all reflections | 0.0353 |
Residual factor for significantly intense reflections | 0.0249 |
Weighted residual factors for significantly intense reflections | 0.0449 |
Weighted residual factors for all reflections included in the refinement | 0.0479 |
Goodness-of-fit parameter for all reflections included in the refinement | 1.009 |
Diffraction radiation wavelength | 0.71069 Å |
Diffraction radiation type | MoKα |