Information card for entry 7220305
Common name | pyrazolo[1,5-a]pyrimidine |
Chemical name | 2-methyl-7-phenylpyrazolo[1,5-a]pyrimidine |
Formula | C13 H11 N3 |
Calculated formula | C13 H11 N3 |
SMILES | c1(ccnc2cc(C)nn12)c1ccccc1 |
Title of publication | Thermodynamic, energetic, and topological properties of crystal packing of pyrazolo[1,5-a]pyrimidines governed by weak electrostatic intermolecular interactions |
Authors of publication | Frizzo, Clarissa P.; Tier, Aniele Z.; Gindri, Izabelle M.; Meyer, Alexandre R.; Black, Gabrielle; Belladona, Andrei L.; Martins, Marcos A. P. |
Journal of publication | CrystEngComm |
Year of publication | 2015 |
Journal volume | 17 |
Journal issue | 23 |
Pages of publication | 4325 |
a | 3.9185 ± 0.0003 Å |
b | 10.5324 ± 0.001 Å |
c | 25.539 ± 0.002 Å |
α | 90° |
β | 90.642 ± 0.003° |
γ | 90° |
Cell volume | 1053.96 ± 0.15 Å3 |
Cell temperature | 296 ± 2 K |
Ambient diffraction temperature | 296 ± 2 K |
Number of distinct elements | 3 |
Space group number | 14 |
Hermann-Mauguin space group symbol | P 1 21/n 1 |
Hall space group symbol | -P 2yn |
Residual factor for all reflections | 0.0931 |
Residual factor for significantly intense reflections | 0.0515 |
Weighted residual factors for significantly intense reflections | 0.1373 |
Weighted residual factors for all reflections included in the refinement | 0.163 |
Goodness-of-fit parameter for all reflections included in the refinement | 1.034 |
Diffraction radiation wavelength | 0.71073 Å |
Diffraction radiation type | MoKα |