Information card for entry 7220315
Common name | chlorophenyl trifluoromethyl methylpyrirazole pyridine |
Chemical name | 5-(4-chlorophenyl)-7-trifluoromethyl-2-methylpyrirazole[1,5-a]pyridine |
Formula | C14 H9 Cl F3 N3 |
Calculated formula | C14 H9 Cl F3 N3 |
SMILES | Clc1ccc(c2nc3n(nc(c3)C)c(c2)C(F)(F)F)cc1 |
Title of publication | Thermodynamic, energetic, and topological properties of crystal packing of pyrazolo[1,5-a]pyrimidines governed by weak electrostatic intermolecular interactions |
Authors of publication | Frizzo, Clarissa P.; Tier, Aniele Z.; Gindri, Izabelle M.; Meyer, Alexandre R.; Black, Gabrielle; Belladona, Andrei L.; Martins, Marcos A. P. |
Journal of publication | CrystEngComm |
Year of publication | 2015 |
Journal volume | 17 |
Journal issue | 23 |
Pages of publication | 4325 |
a | 4.7929 ± 0.0004 Å |
b | 10.5914 ± 0.0009 Å |
c | 26.224 ± 0.002 Å |
α | 90° |
β | 90° |
γ | 90° |
Cell volume | 1331.22 ± 0.19 Å3 |
Cell temperature | 293 ± 2 K |
Ambient diffraction temperature | 293 ± 2 K |
Number of distinct elements | 5 |
Space group number | 19 |
Hermann-Mauguin space group symbol | P 21 21 21 |
Hall space group symbol | P 2ac 2ab |
Residual factor for all reflections | 0.0642 |
Residual factor for significantly intense reflections | 0.0367 |
Weighted residual factors for significantly intense reflections | 0.0766 |
Weighted residual factors for all reflections included in the refinement | 0.0878 |
Goodness-of-fit parameter for all reflections included in the refinement | 1.026 |
Diffraction radiation wavelength | 0.71073 Å |
Diffraction radiation type | MoKα |