Information card for entry 7220355
Formula | C6 H17 Cu3 N12 O18 V5 |
Calculated formula | C6 H14 Cu3 N12 O18 V5 |
Title of publication | Polyoxometalate-directed assembly of various multinuclear metal‒organic complexes with 4-amino-1,2,4-triazole and selective photocatalysis for organic dye degradation |
Authors of publication | Wang, Xiu-Li; Gong, Chun-Hua; Zhang, Ju-Wen; Liu, Guo-Cheng; Kan, Xiao-Min; Xu, Na |
Journal of publication | CrystEngComm |
Year of publication | 2015 |
Journal volume | 17 |
Journal issue | 22 |
Pages of publication | 4179 |
a | 8.7273 ± 0.0009 Å |
b | 12.8497 ± 0.0009 Å |
c | 12.8591 ± 0.001 Å |
α | 86.154 ± 0.001° |
β | 75.879 ± 0.001° |
γ | 75.844 ± 0.001° |
Cell volume | 1356 ± 0.2 Å3 |
Cell temperature | 296 ± 2 K |
Ambient diffraction temperature | 296 ± 2 K |
Number of distinct elements | 6 |
Space group number | 2 |
Hermann-Mauguin space group symbol | P -1 |
Hall space group symbol | -P 1 |
Residual factor for all reflections | 0.0488 |
Residual factor for significantly intense reflections | 0.0354 |
Weighted residual factors for significantly intense reflections | 0.0901 |
Weighted residual factors for all reflections included in the refinement | 0.1014 |
Goodness-of-fit parameter for all reflections included in the refinement | 1.062 |
Diffraction radiation wavelength | 0.71073 Å |
Diffraction radiation type | MoKα |