Information card for entry 7220366
Formula | C20 H28 N8 Nd2 O32 S Zn4 |
Calculated formula | C20 H4 N8 Nd2 O32 S Zn4 |
Title of publication | Construction of four 3d‒4f heterometallic pillar-layered frameworks containing left- and right-handed helical chains and a I−chemosensor |
Authors of publication | Ding, Yu-Jia; Li, Teng; Hong, Xu-Jia; Zhu, Li-Cai; Cai, Yue-Peng; Zhu, Si-Ming; Yu, Shu-Juan |
Journal of publication | CrystEngComm |
Year of publication | 2015 |
Journal volume | 17 |
Journal issue | 21 |
Pages of publication | 3945 |
a | 25.245 ± 0.003 Å |
b | 9.6639 ± 0.001 Å |
c | 20.026 ± 0.002 Å |
α | 90° |
β | 128.93 ± 0.001° |
γ | 90° |
Cell volume | 3800.6 ± 0.7 Å3 |
Cell temperature | 298 ± 2 K |
Ambient diffraction temperature | 298 ± 2 K |
Number of distinct elements | 7 |
Space group number | 15 |
Hermann-Mauguin space group symbol | C 1 2/c 1 |
Hall space group symbol | -C 2yc |
Residual factor for all reflections | 0.0326 |
Residual factor for significantly intense reflections | 0.0287 |
Weighted residual factors for significantly intense reflections | 0.0768 |
Weighted residual factors for all reflections included in the refinement | 0.0791 |
Goodness-of-fit parameter for all reflections included in the refinement | 1.072 |
Diffraction radiation wavelength | 0.71073 Å |
Diffraction radiation type | MoKα |