Information card for entry 7220369
Formula | C20 H28 Gd2 N8 O32 S Zn4 |
Calculated formula | C20 H4 Gd2 N8 O32 S Zn4 |
Title of publication | Construction of four 3d‒4f heterometallic pillar-layered frameworks containing left- and right-handed helical chains and a I−chemosensor |
Authors of publication | Ding, Yu-Jia; Li, Teng; Hong, Xu-Jia; Zhu, Li-Cai; Cai, Yue-Peng; Zhu, Si-Ming; Yu, Shu-Juan |
Journal of publication | CrystEngComm |
Year of publication | 2015 |
Journal volume | 17 |
Journal issue | 21 |
Pages of publication | 3945 |
a | 25.1442 ± 0.0019 Å |
b | 9.6068 ± 0.0007 Å |
c | 19.9794 ± 0.0014 Å |
α | 90° |
β | 128.933 ± 0.002° |
γ | 90° |
Cell volume | 3754.2 ± 0.5 Å3 |
Cell temperature | 298 ± 2 K |
Ambient diffraction temperature | 298 ± 2 K |
Number of distinct elements | 7 |
Space group number | 15 |
Hermann-Mauguin space group symbol | C 1 2/c 1 |
Hall space group symbol | -C 2yc |
Residual factor for all reflections | 0.0263 |
Residual factor for significantly intense reflections | 0.0235 |
Weighted residual factors for significantly intense reflections | 0.0619 |
Weighted residual factors for all reflections included in the refinement | 0.0632 |
Goodness-of-fit parameter for all reflections included in the refinement | 1.09 |
Diffraction radiation wavelength | 0.71073 Å |
Diffraction radiation type | MoKα |