Information card for entry 7220377
Formula | C39 H32 Fe Mn2 N10 O5 |
Calculated formula | C39 H32 Fe Mn2 N10 O5 |
Title of publication | The first photochromic bimetallic assemblies based on Mn(iii) and Mn(ii) Schiff-base (salpn, dapsc) complexes and pentacyanonitrosylferrate |
Authors of publication | Kopotkov, Vyacheslav A.; Sasnovskaya, Valentina D.; Korchagin, Denis V.; Morgunov, Roman B.; Aldoshin, Sergey M.; Simonov, Sergey V.; Zorina, Leokadiya V.; Schaniel, Dominik; Woike, Theo; Yagubskii, Eduard B. |
Journal of publication | CrystEngComm |
Year of publication | 2015 |
Journal volume | 17 |
Journal issue | 20 |
Pages of publication | 3866 |
a | 14.5312 ± 0.0002 Å |
b | 14.5312 ± 0.0002 Å |
c | 18.095 ± 0.0006 Å |
α | 90° |
β | 90° |
γ | 90° |
Cell volume | 3820.86 ± 0.15 Å3 |
Cell temperature | 150.01 ± 0.1 K |
Ambient diffraction temperature | 150.01 ± 0.1 K |
Number of distinct elements | 6 |
Space group number | 130 |
Hermann-Mauguin space group symbol | P 4/n c c :2 |
Hall space group symbol | -P 4a 2ac |
Residual factor for all reflections | 0.0375 |
Residual factor for significantly intense reflections | 0.0307 |
Weighted residual factors for significantly intense reflections | 0.0776 |
Weighted residual factors for all reflections included in the refinement | 0.0824 |
Goodness-of-fit parameter for all reflections included in the refinement | 1.085 |
Diffraction radiation wavelength | 0.7107 Å |
Diffraction radiation type | MoKα |