Information card for entry 7220380
Formula | C46 H39 Ag N2 P2 S2 |
Calculated formula | C46 H39 Ag N2 P2 S2 |
Title of publication | Hemilabile silver(i) complexes containing pyridyl chalcogenolate (S, Se) ligands and their utility as molecular precursors for silver chalcogenides |
Authors of publication | Kole, Goutam Kumar; Vivekananda, K. V.; Kumar, Mukesh; Ganguly, Rakesh; Dey, Sandip; Jain, Vimal K. |
Journal of publication | CrystEngComm |
Year of publication | 2015 |
Journal volume | 17 |
Journal issue | 23 |
Pages of publication | 4367 |
a | 14.7874 ± 0.0004 Å |
b | 17.9105 ± 0.0005 Å |
c | 14.6394 ± 0.0004 Å |
α | 90° |
β | 90° |
γ | 90° |
Cell volume | 3877.24 ± 0.18 Å3 |
Cell temperature | 103 ± 2 K |
Ambient diffraction temperature | 103 ± 2 K |
Number of distinct elements | 6 |
Space group number | 60 |
Hermann-Mauguin space group symbol | P b c n |
Hall space group symbol | -P 2n 2ab |
Residual factor for all reflections | 0.0666 |
Residual factor for significantly intense reflections | 0.0401 |
Weighted residual factors for significantly intense reflections | 0.0768 |
Weighted residual factors for all reflections included in the refinement | 0.0915 |
Goodness-of-fit parameter for all reflections included in the refinement | 1.079 |
Diffraction radiation wavelength | 0.71073 Å |
Diffraction radiation type | MoKα |