Information card for entry 7220382
Formula | C46 H38 Ag2 N2 P2 S2 |
Calculated formula | C46 H38 Ag2 N2 P2 S2 |
Title of publication | Hemilabile silver(i) complexes containing pyridyl chalcogenolate (S, Se) ligands and their utility as molecular precursors for silver chalcogenides |
Authors of publication | Kole, Goutam Kumar; Vivekananda, K. V.; Kumar, Mukesh; Ganguly, Rakesh; Dey, Sandip; Jain, Vimal K. |
Journal of publication | CrystEngComm |
Year of publication | 2015 |
Journal volume | 17 |
Journal issue | 23 |
Pages of publication | 4367 |
a | 9.9533 ± 0.0006 Å |
b | 14.2851 ± 0.0006 Å |
c | 15.24 ± 0.001 Å |
α | 93.498 ± 0.004° |
β | 90.926 ± 0.005° |
γ | 103.226 ± 0.004° |
Cell volume | 2104.5 ± 0.2 Å3 |
Cell temperature | 293 ± 2 K |
Ambient diffraction temperature | 293 ± 2 K |
Number of distinct elements | 6 |
Space group number | 2 |
Hermann-Mauguin space group symbol | P -1 |
Hall space group symbol | -P 1 |
Residual factor for all reflections | 0.0991 |
Residual factor for significantly intense reflections | 0.0796 |
Weighted residual factors for significantly intense reflections | 0.2154 |
Weighted residual factors for all reflections included in the refinement | 0.2533 |
Goodness-of-fit parameter for all reflections included in the refinement | 1.01 |
Diffraction radiation wavelength | 1.5418 Å |
Diffraction radiation type | CuKα |