Information card for entry 7220401
Formula | C32 H44 N2 O10 P2 Zn |
Calculated formula | C32 H44 N2 O10 P2 Zn |
SMILES | c1(c(cccc1C)C)OP(=O)(C(C)(C)O)O[Zn]1([n]2ccccc2c2cccc[n]12)(OP(=O)(C(C)(C)O)Oc1c(cccc1C)C)[OH2].O |
Title of publication | 2,6-Dimethylphenol derived H-phosphonate and α-hydroxyphosphonate: facile synthesis, crystal chemistry, supramolecular association and metal complexation |
Authors of publication | Hossain, Sazzat; Gupta, Sandeep K.; Murugavel, Ramaswamy |
Journal of publication | CrystEngComm |
Year of publication | 2015 |
Journal volume | 17 |
Journal issue | 23 |
Pages of publication | 4355 |
a | 16.398 ± 0.006 Å |
b | 23.992 ± 0.008 Å |
c | 18.942 ± 0.007 Å |
α | 90° |
β | 112.576 ± 0.005° |
γ | 90° |
Cell volume | 6881 ± 4 Å3 |
Cell temperature | 150 ± 2 K |
Ambient diffraction temperature | 150 ± 2 K |
Number of distinct elements | 6 |
Space group number | 14 |
Hermann-Mauguin space group symbol | P 1 21/n 1 |
Hall space group symbol | -P 2yn |
Residual factor for all reflections | 0.1115 |
Residual factor for significantly intense reflections | 0.1009 |
Weighted residual factors for significantly intense reflections | 0.271 |
Weighted residual factors for all reflections included in the refinement | 0.2885 |
Goodness-of-fit parameter for all reflections included in the refinement | 1.188 |
Diffraction radiation wavelength | 0.71075 Å |
Diffraction radiation type | MoKα |