Information card for entry 7220473
Formula | C24 H24 Cu2 N6 O9 |
Calculated formula | C24 H24 Cu2 N6 O9 |
Title of publication | Synthesis, crystal structures, magnetic properties and DFT calculations of nitrate and oxalate complexes with 3,5 dimethyl-1-(2'-pyridyl)-pyrazole-Cu(II) |
Authors of publication | Pal, Pampi; Konar, Saugata; El Fallah, Mohamed Salah; Das, Kinsuk; Bauzá, Antonio; Frontera, Antonio; Mukhopadhyay, Subrata |
Journal of publication | RSC Advances |
Year of publication | 2015 |
Journal volume | 5 |
Journal issue | 56 |
Pages of publication | 45082 - 45091 |
a | 20.402 ± 0.005 Å |
b | 7.233 ± 0.005 Å |
c | 18.215 ± 0.005 Å |
α | 90° |
β | 112.363 ± 0.005° |
γ | 90° |
Cell volume | 2485.8 ± 1.9 Å3 |
Cell temperature | 150 ± 2 K |
Ambient diffraction temperature | 150 ± 2 K |
Number of distinct elements | 5 |
Space group number | 15 |
Hermann-Mauguin space group symbol | C 1 2/c 1 |
Hall space group symbol | -C 2yc |
Residual factor for all reflections | 0.0406 |
Residual factor for significantly intense reflections | 0.0361 |
Weighted residual factors for significantly intense reflections | 0.0919 |
Weighted residual factors for all reflections included in the refinement | 0.0941 |
Goodness-of-fit parameter for all reflections included in the refinement | 1.052 |
Diffraction radiation wavelength | 0.71069 Å |
Diffraction radiation type | MoKα |