Information card for entry 7220483
Formula | C20 H22 I N O4 S |
Calculated formula | C20 H22 I N O4 S |
SMILES | [I-].s1c([n+](c2c1ccc(OC)c2)CC)/C=C/c1cc(OC)c(OC)cc1.O |
Title of publication | Features of styryl dye crystal packings and their influence on [2 + 2] photocycloaddition reaction with single crystal retention |
Authors of publication | Kuz'mina, Lyudmila G.; Vedernikov, Artem I.; Howard, Judith A. K.; Alfimov, Michael V.; Gromov, Sergey P. |
Journal of publication | CrystEngComm |
Year of publication | 2015 |
Journal volume | 17 |
Journal issue | 24 |
Pages of publication | 4584 |
a | 7.7237 ± 0.0005 Å |
b | 10.2576 ± 0.0006 Å |
c | 13.6801 ± 0.0008 Å |
α | 78.32 ± 0.002° |
β | 84.144 ± 0.002° |
γ | 76.52 ± 0.002° |
Cell volume | 1030.43 ± 0.11 Å3 |
Cell temperature | 123.15 K |
Ambient diffraction temperature | 123.15 K |
Number of distinct elements | 6 |
Space group number | 2 |
Hermann-Mauguin space group symbol | P -1 |
Hall space group symbol | -P 1 |
Residual factor for all reflections | 0.0729 |
Residual factor for significantly intense reflections | 0.0637 |
Weighted residual factors for significantly intense reflections | 0.1517 |
Weighted residual factors for all reflections included in the refinement | 0.1615 |
Goodness-of-fit parameter for all reflections included in the refinement | 0.9894 |
Diffraction radiation wavelength | 0.71073 Å |
Diffraction radiation type | MoKα |