Information card for entry 7220504
Formula | C15 H11 Cu N2 O5 |
Calculated formula | C15 H11 Cu N2 O5 |
Title of publication | Effects of hydroxy substituents on Cu(ii) coordination polymers based on 5-hydroxyisophthalate derivatives and 1,4-bis(2-methylimidazol-1-yl)benzene |
Authors of publication | Su, Yanqing; Li, Xinxiong; Li, Xiaoju; Pan, Hui; Wang, Ruihu |
Journal of publication | CrystEngComm |
Year of publication | 2015 |
Journal volume | 17 |
Journal issue | 26 |
Pages of publication | 4883 |
a | 8.7922 ± 0.0006 Å |
b | 14.9186 ± 0.0008 Å |
c | 13.4193 ± 0.001 Å |
α | 90° |
β | 120.13 ± 0.005° |
γ | 90° |
Cell volume | 1522.35 ± 0.19 Å3 |
Cell temperature | 293 ± 2 K |
Ambient diffraction temperature | 293 ± 2 K |
Number of distinct elements | 5 |
Space group number | 14 |
Hermann-Mauguin space group symbol | P 1 21/c 1 |
Hall space group symbol | -P 2ybc |
Residual factor for all reflections | 0.0411 |
Residual factor for significantly intense reflections | 0.0372 |
Weighted residual factors for significantly intense reflections | 0.0897 |
Weighted residual factors for all reflections included in the refinement | 0.0922 |
Goodness-of-fit parameter for all reflections included in the refinement | 1.088 |
Diffraction radiation wavelength | 0.71073 Å |
Diffraction radiation type | MoKα |