Information card for entry 7220509
Formula | C25 H29 Cu N4 O7.5 |
Calculated formula | C25 H24 Cu N4 O7.5 |
Title of publication | Effects of hydroxy substituents on Cu(ii) coordination polymers based on 5-hydroxyisophthalate derivatives and 1,4-bis(2-methylimidazol-1-yl)benzene |
Authors of publication | Su, Yanqing; Li, Xinxiong; Li, Xiaoju; Pan, Hui; Wang, Ruihu |
Journal of publication | CrystEngComm |
Year of publication | 2015 |
Journal volume | 17 |
Journal issue | 26 |
Pages of publication | 4883 |
a | 7.751 ± 0.002 Å |
b | 12.916 ± 0.003 Å |
c | 14.603 ± 0.004 Å |
α | 83.875 ± 0.006° |
β | 88.192 ± 0.007° |
γ | 74.126 ± 0.006° |
Cell volume | 1398.2 ± 0.6 Å3 |
Cell temperature | 293 ± 2 K |
Ambient diffraction temperature | 293 ± 2 K |
Number of distinct elements | 5 |
Space group number | 2 |
Hermann-Mauguin space group symbol | P -1 |
Hall space group symbol | -P 1 |
Residual factor for all reflections | 0.0876 |
Residual factor for significantly intense reflections | 0.0596 |
Weighted residual factors for significantly intense reflections | 0.1708 |
Weighted residual factors for all reflections included in the refinement | 0.192 |
Goodness-of-fit parameter for all reflections included in the refinement | 1.062 |
Diffraction radiation wavelength | 0.71073 Å |
Diffraction radiation type | MoKα |