Information card for entry 7220512
Common name | C-methylpyrogallol[4]arene with rhodamine B |
Formula | C66 H80 N2 O18 |
Calculated formula | C66 H80 N2 O18 |
Title of publication | Establishing trends based on solvent system changes in cocrystals containing pyrogallol[4]arenes and fluorescent probes rhodamine B and pyronin Y |
Authors of publication | Pfeiffer, Constance R.; Fowler, Drew A.; Atwood, Jerry L. |
Journal of publication | CrystEngComm |
Year of publication | 2015 |
Journal volume | 17 |
Journal issue | 24 |
Pages of publication | 4475 |
a | 12.6309 ± 0.0014 Å |
b | 15.1204 ± 0.0017 Å |
c | 16.9812 ± 0.0019 Å |
α | 80.807 ± 0.001° |
β | 75.354 ± 0.001° |
γ | 79.911 ± 0.001° |
Cell volume | 3066.5 ± 0.6 Å3 |
Cell temperature | 173 ± 2 K |
Ambient diffraction temperature | 173 ± 2 K |
Number of distinct elements | 4 |
Space group number | 2 |
Hermann-Mauguin space group symbol | P -1 |
Hall space group symbol | -P 1 |
Residual factor for all reflections | 0.0814 |
Residual factor for significantly intense reflections | 0.0583 |
Weighted residual factors for significantly intense reflections | 0.1574 |
Weighted residual factors for all reflections included in the refinement | 0.1774 |
Goodness-of-fit parameter for all reflections included in the refinement | 1.037 |
Diffraction radiation wavelength | 0.71073 Å |
Diffraction radiation type | MoKα |