Information card for entry 7220516
Common name | C-propylpyrogallol[4]arene with rhodamine B |
Formula | C69 H84.5 N2.5 O17.5 |
Calculated formula | C69 H79.5 N2.5 O17.5 |
Title of publication | Establishing trends based on solvent system changes in cocrystals containing pyrogallol[4]arenes and fluorescent probes rhodamine B and pyronin Y |
Authors of publication | Pfeiffer, Constance R.; Fowler, Drew A.; Atwood, Jerry L. |
Journal of publication | CrystEngComm |
Year of publication | 2015 |
Journal volume | 17 |
Journal issue | 24 |
Pages of publication | 4475 |
a | 33.339 ± 0.011 Å |
b | 12.549 ± 0.004 Å |
c | 31.947 ± 0.011 Å |
α | 90° |
β | 105.02 ± 0.005° |
γ | 90° |
Cell volume | 12909 ± 7 Å3 |
Cell temperature | 173 ± 2 K |
Ambient diffraction temperature | 173 ± 2 K |
Number of distinct elements | 4 |
Space group number | 15 |
Hermann-Mauguin space group symbol | C 1 2/c 1 |
Hall space group symbol | -C 2yc |
Residual factor for all reflections | 0.127 |
Residual factor for significantly intense reflections | 0.0839 |
Weighted residual factors for significantly intense reflections | 0.2358 |
Weighted residual factors for all reflections included in the refinement | 0.2875 |
Goodness-of-fit parameter for all reflections included in the refinement | 1.057 |
Diffraction radiation wavelength | 0.71073 Å |
Diffraction radiation type | MoKα |