Information card for entry 7220519
Formula | C57.25 H42.75 N2.25 O11 Zn2 |
Calculated formula | C54 H38 N2 O10 Zn2 |
Title of publication | Observance of a large conformational change associated with the rotation of the naphthyl groups during the photodimerization of criss-cross aligned CC bonds within a 2D coordination polymer |
Authors of publication | Hu, Fei-Long; Wang, Shu-Long; Abrahams, Brendan F.; Lang, Jian-Ping |
Journal of publication | CrystEngComm |
Year of publication | 2015 |
Journal volume | 17 |
Journal issue | 26 |
Pages of publication | 4903 |
a | 14.3619 ± 0.0004 Å |
b | 24.7111 ± 0.0006 Å |
c | 15.9255 ± 0.0004 Å |
α | 90° |
β | 109.14 ± 0.003° |
γ | 90° |
Cell volume | 5339.5 ± 0.3 Å3 |
Cell temperature | 293 ± 2 K |
Ambient diffraction temperature | 293 ± 2 K |
Number of distinct elements | 5 |
Space group number | 14 |
Hermann-Mauguin space group symbol | P 1 21/c 1 |
Hall space group symbol | -P 2ybc |
Residual factor for all reflections | 0.0761 |
Residual factor for significantly intense reflections | 0.0468 |
Weighted residual factors for significantly intense reflections | 0.1034 |
Weighted residual factors for all reflections included in the refinement | 0.1142 |
Goodness-of-fit parameter for all reflections included in the refinement | 0.992 |
Diffraction radiation wavelength | 0.71073 Å |
Diffraction radiation type | MoKα |