Information card for entry 7220524
Formula | C24 H42 Gd4 N6 O45 |
Calculated formula | C24 H42 Gd4 N6 O45 |
Title of publication | Complex three-dimensional lanthanide metal‒organic frameworks with variable coordination spheres based on pyrazine-2,3,5,6-tetracarboxylate |
Authors of publication | Ingram, Conrad W.; Kibakaya, Geoffrey; Bacsa, John; Mathis,II, Stephan R.; Holder, Alvin A.; Rambaran, Varma H.; Dennis, Brandon; Castaneda, Esmeralda; Robbins, Julianne S.; John Zhang, Z. |
Journal of publication | CrystEngComm |
Year of publication | 2015 |
Journal volume | 17 |
Journal issue | 29 |
Pages of publication | 5377 |
a | 8.5607 ± 0.001 Å |
b | 14.1023 ± 0.0017 Å |
c | 20.294 ± 0.002 Å |
α | 88.5392 ± 0.0017° |
β | 86.4998 ± 0.0015° |
γ | 81.2519 ± 0.0016° |
Cell volume | 2416.7 ± 0.5 Å3 |
Cell temperature | 110 ± 2 K |
Ambient diffraction temperature | 110 ± 2 K |
Number of distinct elements | 5 |
Space group number | 2 |
Hermann-Mauguin space group symbol | P -1 |
Hall space group symbol | -P 1 |
Residual factor for all reflections | 0.069 |
Residual factor for significantly intense reflections | 0.057 |
Weighted residual factors for significantly intense reflections | 0.1455 |
Weighted residual factors for all reflections included in the refinement | 0.1516 |
Goodness-of-fit parameter for all reflections included in the refinement | 1.056 |
Diffraction radiation wavelength | 0.71073 Å |
Diffraction radiation type | MoKα |