Information card for entry 7220550
Common name | dehydrobotrydienol |
Formula | C15 H22 O2 |
Calculated formula | C15 H22 O2 |
SMILES | OCc1c2c(ccc1C)C(C)(C)C[C@@]2(CO)C |
Title of publication | 4,5-seco-Probotryenols A‒C, a new type of sesquiterpenoids from Stachybotrys bisbyi |
Authors of publication | Bao, Yan-Ru; Chen, Guo-Dong; Gao, Hao; He, Rong-Rong; Wu, Yue-Hua; Li, Xiao-Xia; Hu, Dan; Wang, Chuan-Xi; Liu, Xing-Zhong; Li, Yan; Yao, Xin-Sheng |
Journal of publication | RSC Adv. |
Year of publication | 2015 |
Journal volume | 5 |
Journal issue | 57 |
Pages of publication | 46252 |
a | 8.8587 ± 0.0003 Å |
b | 10.9481 ± 0.0004 Å |
c | 13.7817 ± 0.0005 Å |
α | 90° |
β | 90° |
γ | 90° |
Cell volume | 1336.63 ± 0.08 Å3 |
Cell temperature | 173 K |
Ambient diffraction temperature | 173 K |
Number of distinct elements | 3 |
Space group number | 19 |
Hermann-Mauguin space group symbol | P 21 21 21 |
Hall space group symbol | P 2ac 2ab |
Residual factor for all reflections | 0.0819 |
Residual factor for significantly intense reflections | 0.073 |
Weighted residual factors for significantly intense reflections | 0.1899 |
Weighted residual factors for all reflections included in the refinement | 0.2014 |
Goodness-of-fit parameter for all reflections included in the refinement | 1.033 |
Diffraction radiation probe | x-ray |
Diffraction radiation wavelength | 1.54178 Å |
Diffraction radiation type | CuKα |