Information card for entry 7220566
Formula | C8 H20 Cu2 O16 |
Calculated formula | C8 H20 Cu2 O16 |
Title of publication | Synthesis and structural characterization of six Cu(ii)-based coordination polymers using the thermally tunable 1,2,3,4-cyclobutanetetracarboxylic acid |
Authors of publication | Díaz-Gallifa, P.; Fabelo, O.; Pasán, J.; Cañadillas-Delgado, L.; Ramírez, M. A.; Gallardo, A. G.; Ruiz-Pérez, C. |
Journal of publication | CrystEngComm |
Year of publication | 2015 |
Journal volume | 17 |
Journal issue | 27 |
Pages of publication | 5081 |
a | 18.6107 ± 0.0005 Å |
b | 18.6107 ± 0.0005 Å |
c | 4.8022 ± 0.0003 Å |
α | 90° |
β | 90° |
γ | 90° |
Cell volume | 1663.28 ± 0.12 Å3 |
Cell temperature | 150 ± 2 K |
Ambient diffraction temperature | 150 ± 2 K |
Number of distinct elements | 4 |
Space group number | 88 |
Hermann-Mauguin space group symbol | I 41/a :2 |
Hall space group symbol | -I 4ad |
Residual factor for all reflections | 0.0314 |
Residual factor for significantly intense reflections | 0.0299 |
Weighted residual factors for significantly intense reflections | 0.0788 |
Weighted residual factors for all reflections included in the refinement | 0.0805 |
Goodness-of-fit parameter for all reflections included in the refinement | 1.083 |
Diffraction radiation wavelength | 1.5418 Å |
Diffraction radiation type | CuKα |