Information card for entry 7220568
Formula | C28.5 H25.5 Cd2 Cl N9.5 O8.5 |
Calculated formula | C27 H18 Cd2 Cl N9 O6 |
Title of publication | A luminescent cadmium(ii) metal‒organic framework based on a triazolate‒carboxylate ligand exhibiting selective gas adsorption and guest-dependent photoluminescence properties |
Authors of publication | Zhu, Ai-Xin; Qiu, Zhen-Zhe; Yang, Li-Bo; Fang, Xiao-Dan; Chen, Si-Jin; Xu, Quan-Qing; Li, Qiu-Xia |
Journal of publication | CrystEngComm |
Year of publication | 2015 |
Journal volume | 17 |
Journal issue | 26 |
Pages of publication | 4787 |
a | 25.786 ± 0.005 Å |
b | 21.045 ± 0.004 Å |
c | 7.4123 ± 0.0015 Å |
α | 90° |
β | 90° |
γ | 90° |
Cell volume | 4022.4 ± 1.4 Å3 |
Cell temperature | 293 ± 2 K |
Ambient diffraction temperature | 293 ± 2 K |
Number of distinct elements | 6 |
Space group number | 62 |
Hermann-Mauguin space group symbol | P n m a |
Hall space group symbol | -P 2ac 2n |
Residual factor for all reflections | 0.0643 |
Residual factor for significantly intense reflections | 0.0523 |
Weighted residual factors for significantly intense reflections | 0.1243 |
Weighted residual factors for all reflections included in the refinement | 0.1287 |
Goodness-of-fit parameter for all reflections included in the refinement | 1.123 |
Diffraction radiation wavelength | 0.71073 Å |
Diffraction radiation type | MoKα |