Information card for entry 7220595
Formula | C6 H8 N6 O9 S Zn |
Calculated formula | C6 H8 N6 O9 S Zn |
Title of publication | Syntheses, structures, luminescence and magnetic properties of eleven coordination polymers constructed by a N,N′-sulfuryldiimidazole ligand |
Authors of publication | Liu, Kang; Ma, Benhua; Guo, Xiaolei; Ma, Dingxuan; Meng, Lingkun; Zeng, Guang; Yang, Fen; Li, Guanghua; Shi, Zhan; Feng, Shouhua |
Journal of publication | CrystEngComm |
Year of publication | 2015 |
Journal volume | 17 |
Journal issue | 27 |
Pages of publication | 5054 |
a | 16.337 ± 0.003 Å |
b | 11.925 ± 0.002 Å |
c | 14.007 ± 0.003 Å |
α | 90° |
β | 100.84 ± 0.03° |
γ | 90° |
Cell volume | 2680.1 ± 0.9 Å3 |
Cell temperature | 293 ± 2 K |
Ambient diffraction temperature | 293 ± 2 K |
Number of distinct elements | 6 |
Space group number | 15 |
Hermann-Mauguin space group symbol | C 1 2/c 1 |
Hall space group symbol | -C 2yc |
Residual factor for all reflections | 0.0489 |
Residual factor for significantly intense reflections | 0.0376 |
Weighted residual factors for significantly intense reflections | 0.0782 |
Weighted residual factors for all reflections included in the refinement | 0.083 |
Goodness-of-fit parameter for all reflections included in the refinement | 1.071 |
Diffraction radiation wavelength | 0.71073 Å |
Diffraction radiation type | MoKα |