Information card for entry 7220613
Formula | C46.5 H57 Dy3 N8 O18.5 |
Calculated formula | C44 H47 Dy3 N8 O16 |
SMILES | [Dy]1234567([O]8[Dy]9%10%11([O]%12[Dy]%13%14%15%16([O]=C%12C)([O]=C(C)O%13)([O]=C(C)O%10)[O]9c9cccc%10ccc(C=[N]%14CCc%12c[nH]c[n]%15%12)[n]%16c9%10)([O]=C(C)O%11)([O]=C8C)([O]4c4c8c(ccc(C=[N]5CCc5c[nH]c[n]65)[n]78)ccc4)[O]1C(C)=[O]2)OC(=[O]3)C |
Title of publication | Anion-dependent assembly of Dy complexes: structures and magnetic behaviors |
Authors of publication | Chen, Peng; Zhang, Meiqi; Sun, Wenbin; Li, Hongfeng; Zhao, Lang; Yan, Pengfei |
Journal of publication | CrystEngComm |
Year of publication | 2015 |
Journal volume | 17 |
Journal issue | 27 |
Pages of publication | 5066 |
a | 16.7829 ± 0.0007 Å |
b | 17.6513 ± 0.0006 Å |
c | 19.3643 ± 0.0011 Å |
α | 69.388 ± 0.004° |
β | 83.013 ± 0.004° |
γ | 89.894 ± 0.003° |
Cell volume | 5324.2 ± 0.4 Å3 |
Cell temperature | 150 K |
Ambient diffraction temperature | 150 K |
Number of distinct elements | 5 |
Space group number | 2 |
Hermann-Mauguin space group symbol | P -1 |
Hall space group symbol | -P 1 |
Residual factor for all reflections | 0.1218 |
Residual factor for significantly intense reflections | 0.0772 |
Weighted residual factors for significantly intense reflections | 0.195 |
Weighted residual factors for all reflections included in the refinement | 0.2272 |
Goodness-of-fit parameter for all reflections included in the refinement | 0.99 |
Diffraction radiation wavelength | 0.71073 Å |
Diffraction radiation type | MoKα |