Information card for entry 7220621
Formula | C76 H54 N10 O9 Zn2 |
Calculated formula | C76 H54 N10 O9 Zn2 |
Title of publication | Syntheses, characterization and properties of nine novel Zn(ii) coordination polymers based on 4,4′-(phenylazanediyl)dibenzoic acid and various N-donor ligands |
Authors of publication | Zhao, Lun; Guo, Huadong; Tang, Dong; Zhang, Min |
Journal of publication | CrystEngComm |
Year of publication | 2015 |
Journal volume | 17 |
Journal issue | 29 |
Pages of publication | 5451 |
a | 9.3089 ± 0.0006 Å |
b | 50.079 ± 0.003 Å |
c | 14.5655 ± 0.0009 Å |
α | 90° |
β | 107.953 ± 0.001° |
γ | 90° |
Cell volume | 6459.5 ± 0.7 Å3 |
Cell temperature | 293 ± 2 K |
Ambient diffraction temperature | 293 ± 2 K |
Number of distinct elements | 5 |
Space group number | 14 |
Hermann-Mauguin space group symbol | P 1 21/n 1 |
Hall space group symbol | -P 2yn |
Residual factor for all reflections | 0.1526 |
Residual factor for significantly intense reflections | 0.061 |
Weighted residual factors for significantly intense reflections | 0.1374 |
Weighted residual factors for all reflections included in the refinement | 0.1802 |
Goodness-of-fit parameter for all reflections included in the refinement | 1.038 |
Diffraction radiation wavelength | 0.71073 Å |
Diffraction radiation type | MoKα |