Information card for entry 7220652
Formula | C12 H10 N3 O3 S V |
Calculated formula | C12 H10 N3 O3 S V |
Title of publication | Oxidovanadium(V) complexes of aroylhydrazones incorporating heterocycles: Synthesis, characterization and study of DNA binding, photo-induced DNA cleavage and cytotoxic activities |
Authors of publication | Dash, Subhashree Priyadarsini; Panda, Alok K.; Pasayat, Sagarika; Dinda, Rupam; Biswas, Ashis; Tiekink, Edward R. T.; Mukhopadhyay, Subhadip; Bhutia, Sujit; Kaminsky, Werner; Sinn, Ekkehard |
Journal of publication | RSC Adv. |
Year of publication | 2015 |
a | 7.1876 ± 0.0003 Å |
b | 10.6882 ± 0.0004 Å |
c | 16.6167 ± 0.0006 Å |
α | 90° |
β | 92.567 ± 0.002° |
γ | 90° |
Cell volume | 1275.26 ± 0.09 Å3 |
Cell temperature | 100 ± 2 K |
Ambient diffraction temperature | 100 ± 2 K |
Number of distinct elements | 6 |
Space group number | 14 |
Hermann-Mauguin space group symbol | P 1 21/c 1 |
Hall space group symbol | -P 2ybc |
Residual factor for all reflections | 0.0295 |
Residual factor for significantly intense reflections | 0.0277 |
Weighted residual factors for significantly intense reflections | 0.0745 |
Weighted residual factors for all reflections included in the refinement | 0.0759 |
Goodness-of-fit parameter for all reflections included in the refinement | 1.138 |
Diffraction radiation wavelength | 0.71069 Å |
Diffraction radiation type | MoKα |