Information card for entry 7220659
Formula | C34 H38 Cl2 Cu Hg3 N8 O10 |
Calculated formula | C34 H38 Cl2 Cu Hg3 N8 O10 |
Title of publication | Bis(4-pyridyl)mercury ‒ a new linear tecton in crystal engineering: coordination polymers and co-crystallization processes |
Authors of publication | Mocanu, Teodora; Raţ, Ciprian I.; Maxim, Catalin; Shova, Sergiu; Tudor, Violeta; Silvestru, Cristian; Andruh, Marius |
Journal of publication | CrystEngComm |
Year of publication | 2015 |
Journal volume | 17 |
Journal issue | 29 |
Pages of publication | 5474 |
a | 8.2953 ± 0.0002 Å |
b | 10.6258 ± 0.0005 Å |
c | 12.4574 ± 0.0004 Å |
α | 83.389 ± 0.006° |
β | 81.479 ± 0.003° |
γ | 84.419 ± 0.004° |
Cell volume | 1075.11 ± 0.07 Å3 |
Cell temperature | 293 ± 2 K |
Ambient diffraction temperature | 293 ± 2 K |
Number of distinct elements | 7 |
Space group number | 2 |
Hermann-Mauguin space group symbol | P -1 |
Hall space group symbol | -P 1 |
Residual factor for all reflections | 0.0786 |
Residual factor for significantly intense reflections | 0.0371 |
Weighted residual factors for significantly intense reflections | 0.0791 |
Weighted residual factors for all reflections included in the refinement | 0.1087 |
Goodness-of-fit parameter for all reflections included in the refinement | 1.035 |
Diffraction radiation wavelength | 0.71073 Å |
Diffraction radiation type | MoKα |