Information card for entry 7220681
Formula | C16 H20 N9 O0.5 Zn |
Calculated formula | C16 H19 N9 O0.5 Zn |
Title of publication | Exploration of CH⋯π interactions involving the π-system of pseudohalide coligands in metal complexes of a Schiff-base ligand |
Authors of publication | Chakraborty, Prateeti; Purkait, Suranjana; Mondal, Sandip; Bauzá, Antonio; Frontera, Antonio; Massera, Chiara; Das, Debasis |
Journal of publication | CrystEngComm |
Year of publication | 2015 |
Journal volume | 17 |
Journal issue | 25 |
Pages of publication | 4680 |
a | 9.1391 ± 0.0005 Å |
b | 9.3535 ± 0.0006 Å |
c | 22.769 ± 0.001 Å |
α | 97.837 ± 0.002° |
β | 91.624 ± 0.002° |
γ | 96.775 ± 0.002° |
Cell volume | 1912.76 ± 0.18 Å3 |
Cell temperature | 296 ± 2 K |
Ambient diffraction temperature | 296 ± 2 K |
Number of distinct elements | 5 |
Space group number | 2 |
Hermann-Mauguin space group symbol | P -1 |
Hall space group symbol | -P 1 |
Residual factor for all reflections | 0.0493 |
Residual factor for significantly intense reflections | 0.0349 |
Weighted residual factors for significantly intense reflections | 0.093 |
Weighted residual factors for all reflections included in the refinement | 0.1004 |
Goodness-of-fit parameter for all reflections included in the refinement | 1.067 |
Diffraction radiation wavelength | 0.71069 Å |
Diffraction radiation type | MoKα |