Information card for entry 7220709
Formula |
Fe0.5 Ge La3 Se7 |
Calculated formula |
Fe0.504 Ge La3 Se7 |
Title of publication |
Synthesis, Structure, Magnetic and Photoelectric Properties of Ln3M0.5M’Se7 (Ln= La, Ce, Sm; M= Fe, Mn; M’= Si, Ge) and La3MnGaSe7 |
Authors of publication |
He, Jianqiao; Wang, Zhe; Zhang, Xian; Cheng, Ye; Gong, Yu; Lai, Xiaofang; Chong, Zheng; Lin, Jianhua; Huang, Fu Qiang |
Journal of publication |
RSC Adv. |
Year of publication |
2015 |
a |
10.7186 ± 0.0003 Å |
b |
10.7186 ± 0.0003 Å |
c |
6.0797 ± 0.0003 Å |
α |
90° |
β |
90° |
γ |
120° |
Cell volume |
604.91 ± 0.04 Å3 |
Cell temperature |
293 ± 2 K |
Ambient diffraction temperature |
293 ± 2 K |
Number of distinct elements |
4 |
Space group number |
173 |
Hermann-Mauguin space group symbol |
P 63 |
Hall space group symbol |
P 6c |
Residual factor for all reflections |
0.046 |
Residual factor for significantly intense reflections |
0.0454 |
Weighted residual factors for significantly intense reflections |
0.0947 |
Weighted residual factors for all reflections included in the refinement |
0.0951 |
Goodness-of-fit parameter for all reflections included in the refinement |
1.026 |
Diffraction radiation wavelength |
0.71073 Å |
Diffraction radiation type |
MoKα |
Yes |
No |
No |