Information card for entry 7220714
Formula |
Ge Mn0.5 Se7 Sm3 |
Calculated formula |
Ge Mn0.5 Se7 Sm3 |
Title of publication |
Synthesis, Structure, Magnetic and Photoelectric Properties of Ln3M0.5M’Se7 (Ln= La, Ce, Sm; M= Fe, Mn; M’= Si, Ge) and La3MnGaSe7 |
Authors of publication |
He, Jianqiao; Wang, Zhe; Zhang, Xian; Cheng, Ye; Gong, Yu; Lai, Xiaofang; Chong, Zheng; Lin, Jianhua; Huang, Fu Qiang |
Journal of publication |
RSC Adv. |
Year of publication |
2015 |
a |
10.3958 ± 0.0008 Å |
b |
10.3958 ± 0.0008 Å |
c |
6.0175 ± 0.0007 Å |
α |
90° |
β |
90° |
γ |
120° |
Cell volume |
563.2 ± 0.09 Å3 |
Cell temperature |
293 ± 2 K |
Ambient diffraction temperature |
293 ± 2 K |
Number of distinct elements |
4 |
Space group number |
173 |
Hermann-Mauguin space group symbol |
P 63 |
Hall space group symbol |
P 6c |
Residual factor for all reflections |
0.0685 |
Residual factor for significantly intense reflections |
0.0649 |
Weighted residual factors for significantly intense reflections |
0.1432 |
Weighted residual factors for all reflections included in the refinement |
0.1461 |
Goodness-of-fit parameter for all reflections included in the refinement |
1.008 |
Diffraction radiation wavelength |
0.71073 Å |
Diffraction radiation type |
MoKα |
Yes |
No |
No |