Information card for entry 7220717
Formula | C18 H34 Cu2 N2 O10 |
Calculated formula | C18 H34 Cu2 N2 O10 |
Title of publication | Mono-and Tetra-nuclear copper complexes bearing bis(imino)phenoxide derived ligands: catalytic evaluation for benzene oxidation and ROP of epsilon-caprolactone |
Authors of publication | Wang, Xue; Zhao, Keqing; Elsegood, Mark Robert James; Prior, Timothy J.; Liu, Xiaoming; Li, Wu; Sanz, Sergio; Brechin, Euan K.; Redshaw, Carl |
Journal of publication | RSC Adv. |
Year of publication | 2015 |
a | 12.2105 ± 0.0004 Å |
b | 11.5458 ± 0.0004 Å |
c | 17.7582 ± 0.0005 Å |
α | 90° |
β | 101.407 ± 0.003° |
γ | 90° |
Cell volume | 2454.1 ± 0.14 Å3 |
Cell temperature | 293 ± 2 K |
Ambient diffraction temperature | 293 ± 2 K |
Number of distinct elements | 5 |
Space group number | 14 |
Hermann-Mauguin space group symbol | P 1 21/n 1 |
Hall space group symbol | -P 2yn |
Residual factor for all reflections | 0.0517 |
Residual factor for significantly intense reflections | 0.0359 |
Weighted residual factors for significantly intense reflections | 0.0771 |
Weighted residual factors for all reflections included in the refinement | 0.0853 |
Goodness-of-fit parameter for all reflections included in the refinement | 1.038 |
Diffraction radiation wavelength | 0.71073 Å |
Diffraction radiation type | MoKα |