Information card for entry 7220785
Formula |
C26 H28 Mn N4 O6 V2 |
Calculated formula |
C26 H28 Mn N4 O6 V2 |
Title of publication |
POM-based inorganic-organic hybrid compounds: synthesis, structures, high-connected topologies and photodegradation of Organic dyes |
Authors of publication |
Li, Xiao; Yang, Liu; Qin, Chao; Liu, Fu-Hong; Zhao, Liang; Shao, Kui-Zhan; Su, Zhong-Min |
Journal of publication |
RSC Adv. |
Year of publication |
2015 |
a |
21.5654 ± 0.0011 Å |
b |
21.5654 ± 0.0011 Å |
c |
13.0149 ± 0.0008 Å |
α |
90° |
β |
90° |
γ |
90° |
Cell volume |
6052.8 ± 0.6 Å3 |
Cell temperature |
293 ± 2 K |
Ambient diffraction temperature |
293 ± 2 K |
Number of distinct elements |
6 |
Space group number |
88 |
Hermann-Mauguin space group symbol |
I 41/a :2 |
Hall space group symbol |
-I 4ad |
Residual factor for all reflections |
0.0551 |
Residual factor for significantly intense reflections |
0.0393 |
Weighted residual factors for significantly intense reflections |
0.1089 |
Weighted residual factors for all reflections included in the refinement |
0.1173 |
Goodness-of-fit parameter for all reflections included in the refinement |
1.061 |
Diffraction radiation wavelength |
0.71073 Å |
Diffraction radiation type |
MoKα |
Yes |
No |
No |