Information card for entry 7220787
Formula |
C52 H62 N8 Ni3 O24 V6 |
Calculated formula |
C52 H64 N8 Ni3 O24 V6 |
Title of publication |
POM-based inorganic-organic hybrid compounds: synthesis, structures, high-connected topologies and photodegradation of Organic dyes |
Authors of publication |
Li, Xiao; Yang, Liu; Qin, Chao; Liu, Fu-Hong; Zhao, Liang; Shao, Kui-Zhan; Su, Zhong-Min |
Journal of publication |
RSC Adv. |
Year of publication |
2015 |
a |
13.081 ± 0.003 Å |
b |
16.379 ± 0.004 Å |
c |
15.407 ± 0.004 Å |
α |
90° |
β |
102.368 ± 0.005° |
γ |
90° |
Cell volume |
3224.4 ± 1.4 Å3 |
Cell temperature |
293 ± 2 K |
Ambient diffraction temperature |
293 ± 2 K |
Number of distinct elements |
6 |
Space group number |
14 |
Hermann-Mauguin space group symbol |
P 1 21/n 1 |
Hall space group symbol |
-P 2yn |
Residual factor for all reflections |
0.0632 |
Residual factor for significantly intense reflections |
0.0376 |
Weighted residual factors for significantly intense reflections |
0.0844 |
Weighted residual factors for all reflections included in the refinement |
0.0968 |
Goodness-of-fit parameter for all reflections included in the refinement |
1.013 |
Diffraction radiation wavelength |
0.71073 Å |
Diffraction radiation type |
MoKα |
Yes |
No |
No |