Information card for entry 7220800
Formula | C30 H60 Cu Mo18 N12 O79 P6 Sr |
Calculated formula | C30 H60 Cu Mo18 N12 O79 P6 Sr |
Title of publication | 1,4-Bis(imidazole)butane ligand and strontium(ii) directed 1-D chains based on basket-type molybdophosphates and transition metal (TM) linkers |
Authors of publication | Zhang, He; Lv, Jing-Hua; Yu, Kai; Wang, Chun-Mei; Wang, Chun-Xiao; Wang, Lu; Zhou, Bai-Bin |
Journal of publication | CrystEngComm |
Year of publication | 2015 |
Journal volume | 17 |
Journal issue | 32 |
Pages of publication | 6110 |
a | 22.5048 ± 0.0015 Å |
b | 13.6765 ± 0.0009 Å |
c | 30.833 ± 0.002 Å |
α | 90° |
β | 97.187 ± 0.001° |
γ | 90° |
Cell volume | 9415.4 ± 1.1 Å3 |
Cell temperature | 298 ± 2 K |
Ambient diffraction temperature | 298 ± 2 K |
Number of distinct elements | 8 |
Space group number | 14 |
Hermann-Mauguin space group symbol | P 1 21/c 1 |
Hall space group symbol | -P 2ybc |
Residual factor for all reflections | 0.0716 |
Residual factor for significantly intense reflections | 0.0438 |
Weighted residual factors for significantly intense reflections | 0.0906 |
Weighted residual factors for all reflections included in the refinement | 0.1091 |
Goodness-of-fit parameter for all reflections included in the refinement | 1.054 |
Diffraction radiation wavelength | 0.71073 Å |
Diffraction radiation type | MoKα |