Information card for entry 7220802
Formula | C30 H66 Mo18 N12 O82 P6 Sr Zn |
Calculated formula | C30 H66 Mo18 N12 O82 P6 Sr Zn |
Title of publication | 1,4-Bis(imidazole)butane ligand and strontium(ii) directed 1-D chains based on basket-type molybdophosphates and transition metal (TM) linkers |
Authors of publication | Zhang, He; Lv, Jing-Hua; Yu, Kai; Wang, Chun-Mei; Wang, Chun-Xiao; Wang, Lu; Zhou, Bai-Bin |
Journal of publication | CrystEngComm |
Year of publication | 2015 |
Journal volume | 17 |
Journal issue | 32 |
Pages of publication | 6110 |
a | 22.948 ± 0.012 Å |
b | 13.853 ± 0.007 Å |
c | 30.672 ± 0.015 Å |
α | 90° |
β | 97.682 ± 0.008° |
γ | 90° |
Cell volume | 9663 ± 8 Å3 |
Cell temperature | 298 ± 2 K |
Ambient diffraction temperature | 298 ± 2 K |
Number of distinct elements | 8 |
Space group number | 14 |
Hermann-Mauguin space group symbol | P 1 21/c 1 |
Hall space group symbol | -P 2ybc |
Residual factor for all reflections | 0.0653 |
Residual factor for significantly intense reflections | 0.046 |
Weighted residual factors for significantly intense reflections | 0.0959 |
Weighted residual factors for all reflections included in the refinement | 0.1109 |
Goodness-of-fit parameter for all reflections included in the refinement | 1.044 |
Diffraction radiation wavelength | 0.71073 Å |
Diffraction radiation type | MoKα |