Information card for entry 7220804
Formula | C30 H62 Co Mo18 N12 O80 P6 Sr |
Calculated formula | C30 H62 Co Mo18 N12 O80 P6 Sr |
Title of publication | 1,4-Bis(imidazole)butane ligand and strontium(ii) directed 1-D chains based on basket-type molybdophosphates and transition metal (TM) linkers |
Authors of publication | Zhang, He; Lv, Jing-Hua; Yu, Kai; Wang, Chun-Mei; Wang, Chun-Xiao; Wang, Lu; Zhou, Bai-Bin |
Journal of publication | CrystEngComm |
Year of publication | 2015 |
Journal volume | 17 |
Journal issue | 32 |
Pages of publication | 6110 |
a | 23.293 ± 0.016 Å |
b | 14.056 ± 0.01 Å |
c | 31.34 ± 0.02 Å |
α | 90° |
β | 97.651 ± 0.012° |
γ | 90° |
Cell volume | 10170 ± 12 Å3 |
Cell temperature | 298 ± 2 K |
Ambient diffraction temperature | 298 ± 2 K |
Number of distinct elements | 8 |
Space group number | 14 |
Hermann-Mauguin space group symbol | P 1 21/c 1 |
Hall space group symbol | -P 2ybc |
Residual factor for all reflections | 0.051 |
Residual factor for significantly intense reflections | 0.0386 |
Weighted residual factors for significantly intense reflections | 0.0898 |
Weighted residual factors for all reflections included in the refinement | 0.0953 |
Goodness-of-fit parameter for all reflections included in the refinement | 1.071 |
Diffraction radiation wavelength | 0.71073 Å |
Diffraction radiation type | MoKα |