Information card for entry 7220808
Formula | C18 H26 N8 O18 Tb2 |
Calculated formula | C18 H26 N8 O18 Tb2 |
Title of publication | Lanthanide coordination polymers constructed from 5-(1H-tetrazol-5-yl)isophthalic acid ligand: white light emission and color tuning |
Authors of publication | Jia, Jia; Xu, Jianing; Wang, Shengyan; Wang, Pengcheng; Gao, Lijuan; Yu, Miao; Fan, Yong; Wang, Li |
Journal of publication | CrystEngComm |
Year of publication | 2015 |
Journal volume | 17 |
Journal issue | 31 |
Pages of publication | 6030 |
a | 7.9698 ± 0.0004 Å |
b | 9.7137 ± 0.0005 Å |
c | 10.377 ± 0.0005 Å |
α | 116.863 ± 0.001° |
β | 107.286 ± 0.001° |
γ | 95.696 ± 0.001° |
Cell volume | 658.07 ± 0.06 Å3 |
Cell temperature | 296 ± 2 K |
Ambient diffraction temperature | 296 ± 2 K |
Number of distinct elements | 5 |
Space group number | 2 |
Hermann-Mauguin space group symbol | P -1 |
Hall space group symbol | -P 1 |
Residual factor for all reflections | 0.0275 |
Residual factor for significantly intense reflections | 0.0259 |
Weighted residual factors for significantly intense reflections | 0.0664 |
Weighted residual factors for all reflections included in the refinement | 0.0674 |
Goodness-of-fit parameter for all reflections included in the refinement | 1.039 |
Diffraction radiation wavelength | 0.71073 Å |
Diffraction radiation type | MoKα |